Home > ans1327w error > tsm backup error 4353

Tsm Backup Error 4353

80070057 tdpexcc tdpexc dsmagent circular Technote (troubleshooting) Problem(Abstract) Attempts to take an incremental backup of Exchange ans1327w error code -1 databases results in a snapshot operation failure, followed by an

Ans5258e Microsoft Volume Shadow Copy Snapshot Initialization Failed.

API error. Symptom The tdpexc.log, or GUI/command line output will report the following: ANS1327W The snapshot operation ans1327w error code 105 for '\Microsoft Exchange Writer\{VSS GUID}\ \{DB GUID}' failed with error code: 4353. ACN5060E A Tivoli Storage Manager API error has occurred. Reviewing the local dsmagent log ans5273e (dsmerror.log in BAclient folder) shows: ANS5258E (RC4353) Microsoft volume shadow copy snapshot initialization failed The Windows Application event log shows this during the snapshot attempt: The Microsoft Exchange Replication service VSS Writer instance {VSS GUID} failed with error code 80070057 when preparing for a backup of database 'DB Name'. Cause The error code '80070057' indicates

Ans1959i

an invalid parameter was passed. This is caused when circular logging is enabled and an incremental process is attempted. Environment Exchange databases with circular logging enabled Diagnosing the problem Review the Data Protection client logs, and the dsmagent log to validate what snapshot failure occurred. Then checking the Application Event log to confirm the error code from VSS Resolving the problem When circular logging is enabled, incremental and differential processing is not supported. This is because the log may wrap before the operations completes. For this situation, either disable circular logging or refrain from using incremental/differential processing. Related information TDP Exchange backup types Product Alias/Synonym TSM Document information More support for: Tivoli Storage Manager for Mail Data Protection for MS Exchange Software version: All Versions Operating system(s): Windows Reference #: 1692608 Modified date: 30 December 2014 Site availability Site assistance Contact and feedback Need support? Submit feedback to IBM Support 1-800-IBM-7378 (USA) Directory of worldwide contacts Contact Privacy Terms of use Accessibility

ANS2698E ANS1377W snapshot fail Technote (troubleshooting) Problem(Abstract) Backup performing snapshot ans5269e backup fails with ANS1327 and return code 653, ANS1377E may "registry writer" has reported an error 0x800423f4 also be logged. Symptom The dsmerror.log will show the following errors: 01/06/2014 11:26:55 ANS1327W

Ans5283e The Operation Was Unsuccessful.

The snapshot operation for 'h:\volid4' failed with error code: 653. 01/06/2014 11:26:55 ANS2698E Snapshot operation failed. ... 01/06/2014 11:35:27 ANS1377W The client was unable to http://www-01.ibm.com/support/docview.wss?uid=swg21692608 obtain a snapshot of '\\testhost1\t$'. The operation will continue without snapshot support. Cause The VSS_E_MAXIMUM_NUMBER_OF_VOLUMES_REACHED error in the trace shows that the limit of 64 shadow copied volumes in a single shadow copy set has been reached. The maximum number of shadow copied volumes in a single shadow copy http://www-01.ibm.com/support/docview.wss?uid=swg21661854 set is 64, this is documented by Microsoft at this link: http://msdn.microsoft.com/en-us/library/aa382650%28v=vs.85%29.aspx Diagnosing the problem Generate a trace using the SERVICE trace flag, review the trace for the following: 01/06/2014 11:26:55.377 [611040] [402692] : DVssSnapshot.cpp ( 928): DVssSnapshot::initializeSnapshot(): VSS[AddToSnapshotSet]: add volume 'h:\undo\' to snapshot set '{909a9fc9-3fbb-4b1c-ad58-0bca36af5183}' 01/06/2014 11:26:55.382 [611040] [402692] : DVssSnapshot.cpp (1864): DVssSnapshot::initializeSnapshot(): VSS[AddToSnapshotSet: VSS_E_MAXIMUM_NUMBER_OF_VOLUMES_REACHED (See the Microsoft Application event log for additional VSS messages). The command used to enumerate the volume shadow copies on a mounted volume is: vssadmin list shadows /for=: For example, to list the shadow copies for the D drive: vssadmin list shadows /for=d: Resolving the problem As this is a Microsoft limitation, backups will need to be split up into portions of 63 (or less) filesystems in a single schedule. Product Alias/Synonym TSM Document information More support for: Tivoli Storage Manager Client Software version: All Supported Versions Operating system(s

a Question Ask for Help Receive Real-Time Help Create a Freelance Project Hire for a Full Time Job Ways to https://www.experts-exchange.com/questions/28312020/TSM-backup-errors-in-dsmerror-log-ANS0361I-DIAG-VssRequestor-checkWriterStatus-VssRequestor-checkWriterStatus-failed-with-hr-VSS-E-WRITERERROR-TIMEOUT.html Get Help Ask a Question Ask for Help Receive Real-Time Help Create a Freelance Project Hire for a Full Time Job Ways to Get Help Expand Search Submit Close Search Login Join Today Products BackProducts Gigs Live Courses Vendor Services Groups Careers Store Headlines Website Testing Experts Exchange > ans1327w error Questions > TSM backup errors in dsmerror.log: ANS0361I DIAG: VssRequestor::checkWriterStatus: VssRequestor::checkWriterStatus failed with hr=VSS_E_WRITERERROR_TIMEOUT Want to Advertise Here? Solved TSM backup errors in dsmerror.log: ANS0361I DIAG: VssRequestor::checkWriterStatus: VssRequestor::checkWriterStatus failed with hr=VSS_E_WRITERERROR_TIMEOUT Posted on 2013-12-06 Storage Software Storage MS Server OS 2 Verified Solutions 6 Comments 7,495 Views Last ans1327w error code Modified: 2013-12-23 We are using TSM for backups. I am getting this error in the dsmerror.log of a 2008 R2 server: 12/05/2013 05:28:49 ANS1512E Scheduled event 'DAILY_SCHEDULE' failed. Return code = 12. 12/05/2013 23:00:50 ANS0361I DIAG: VssRequestor::checkWriterStatus: VssRequestor::checkWriterStatus failed with hr=VSS_E_WRITERERROR_TIMEOUT 12/05/2013 23:00:50 ANS5268W The Microsoft Volume Shadow Copy Services writer 'System Writer' current state (VSS_WS_FAILED_AT_FREEZE) is not valid for the current operation. 12/05/2013 23:01:20 ANS0361I DIAG: VssRequestor::checkWriterStatus: VssRequestor::checkWriterStatus failed with hr=VSS_E_WRITERERROR_TIMEOUT 12/05/2013 23:01:20 ANS5268W The Microsoft Volume Shadow Copy Services writer 'System Writer' current state (VSS_WS_FAILED_AT_FREEZE) is not valid for the current operation. 12/05/2013 23:01:50 ANS0361I DIAG: VssRequestor::checkWriterStatus: VssRequestor::checkWriterStatus failed with hr=VSS_E_WRITERERROR_TIMEOUT 12/05/2013 23:01:50 ANS5268W The Microsoft Volume Shadow Copy Services writer 'System Writer' current state (VSS_WS_FAILED_AT_FREEZE) is not valid for the current operation. 12/05/2013 23:02:20 ANS0361I DIAG: VssRequestor::checkWriterStatus: VssRequestor::checkWriterStatus failed with hr=VSS_E_WRITERERROR_TIMEOUT 12/05/2013 23:02:20 ANS5268W The Microsoft Volume Shadow Copy Services writ

Related content

tsm error failed to start the snapshot
Tsm Error Failed To Start The Snapshot p tdp exchange ANS E BaStartSnapshot initializeSnapshotSet HRESULT VSS E NO SNAPSHOTS IMPORTED ACN E ACN E Technote troubleshooting Problem Abstract ans w error code - A Data Protection for Exchange backup fails with errors shown ans e an unexpected error was encountered in tsm below Symptom tdpexc log shows ACN E Errors occurred while processing the VSS operation Examine the Windows Event ans e an unexpected error was encountered tsm function name vssinitbackupspec Logs and DSMERROR LOG for additional details VSS Backup operation completed with rc ACN E The VSS operation failed